Target
Leucine-rich repeat serine/threonine-protein kinase 2
Ligand
BDBM50428698
Substrate
Meas. Tech.
In Vitro Kinase Activities (LRRK2 TR-FRET Peptide Assay)
pH
7.5±n/a
Temperature
298.15±n/a K
IC50
9.00±n/a nM
Comments
extracted
Citation
 Aubele, DLGarofalo, AWBowers, STruong, APYe, XMFranzini, MAdler, MNeitz, RJProbst, G Substituted cinnolines as inhibitors of LRRK2 kinase activity US Patent  US9884828 Publication Date 2/6/2018 
Target
Name:
Leucine-rich repeat serine/threonine-protein kinase 2
Synonyms:
Dardarin LRRK2_HUMAN Leucine-rich repeat serine/threonine-protein kinase 2 PARK8
Type:
Protein
Mol. Mass.:
286113.20
Organism:
Homo sapiens (Human)
Description:
Q5S007
Residue:
2527
  
Inhibitor
Name:
BDBM50428698
Synonyms:
CHEMBL2333118 | US9884828, 2-35
Type:
Small organic molecule
Emp. Form.:
C16H18N6O
Mol. Mass.:
310.3537
SMILES:
CC(C)Nc1c(nnc2cc(ccc12)-c1cnn(C)c1)C(N)=O
: