Target
Leucine-rich repeat serine/threonine-protein kinase 2
Ligand
BDBM282613
Substrate
Meas. Tech.
In Vitro Kinase Activities (LRRK2 TR-FRET Peptide Assay)
pH
7.5±n/a
Temperature
298.15±n/a K
IC50
4300±n/a nM
Comments
extracted
Citation
 Aubele, DLGarofalo, AWBowers, STruong, APYe, XMFranzini, MAdler, MNeitz, RJProbst, G Substituted cinnolines as inhibitors of LRRK2 kinase activity US Patent  US9884828 Publication Date 2/6/2018 
Target
Name:
Leucine-rich repeat serine/threonine-protein kinase 2
Synonyms:
Dardarin LRRK2_HUMAN Leucine-rich repeat serine/threonine-protein kinase 2 PARK8
Type:
Protein
Mol. Mass.:
286113.20
Organism:
Homo sapiens (Human)
Description:
Q5S007
Residue:
2527
  
Inhibitor
Name:
BDBM282613
Synonyms:
US9884828, 2-108
Type:
Small organic molecule
Emp. Form.:
C21H19F3N4O2
Mol. Mass.:
416.3964
SMILES:
C[C@@H](Nc1c(nnc2cc(ccc12)-c1ccccc1OC(F)(F)F)C(N)=O)C1CC1
: