Target
Leucine-rich repeat serine/threonine-protein kinase 2
Ligand
BDBM50428701
Substrate
Meas. Tech.
In Vitro Kinase Activities (LRRK2 TR-FRET Peptide Assay)
pH
7.5±n/a
Temperature
298.15±n/a K
IC50
<6.00±n/a nM
Comments
extracted
Citation
 Aubele, DLGarofalo, AWBowers, STruong, APYe, XMFranzini, MAdler, MNeitz, RJProbst, G Substituted cinnolines as inhibitors of LRRK2 kinase activity US Patent  US9884828 Publication Date 2/6/2018 
Target
Name:
Leucine-rich repeat serine/threonine-protein kinase 2
Synonyms:
Dardarin LRRK2_HUMAN Leucine-rich repeat serine/threonine-protein kinase 2 PARK8
Type:
Protein
Mol. Mass.:
286113.20
Organism:
Homo sapiens (Human)
Description:
Q5S007
Residue:
2527
  
Inhibitor
Name:
BDBM50428701
Synonyms:
CHEMBL2333115 | US9884828, 2-127
Type:
Small organic molecule
Emp. Form.:
C15H16N6O
Mol. Mass.:
296.3271
SMILES:
CC(C)Nc1c(nnc2ccc(cc12)-c1cn[nH]c1)C(N)=O
: