Target
Beta-secretase 1
Ligand
BDBM123873
Substrate
Meas. Tech.
Immunofluorescence Resonance Energy Transfer (FRET) Assay
pH
4.5±n/a
IC50
240±n/a nM
Comments
extracted
Citation
 Gabellieri, EGuba, WHilpert, HMauser, HMayweg, AVRogers-Evans, MRombach, DThomas, AWoltering, TWostl, W 1,4-oxazepines as BACE1 and/or BACE2 inhibitors US Patent  US8748418 Publication Date 6/10/2014 
Target
Name:
Beta-secretase 1
Synonyms:
ASP2 Aspartyl protease 2 BACE1 Beta-secretase (BACE) Beta-secretase 1 (BACE 1) Beta-secretase 1 (BACE1) Beta-site amyloid precursor protein cleaving enzyme 1 Memapsin-2 beta-Secretase (BACE-1) | beta-Secretase (BACE1)
Type:
Protein
Mol. Mass.:
55755.10
Organism:
Homo sapiens (Human)
Description:
P56817
Residue:
501
  
Inhibitor
Name:
BDBM123873
Synonyms:
US8748418, 18
Type:
Small organic molecule
Emp. Form.:
C18H22F3N5O
Mol. Mass.:
381.3954
SMILES:
Cn1ccc(Nc2ccc(F)c(c2)[C@@]2(C)N=C(N)COC(C)(C)C2(F)F)n1
: