Target
Beta-secretase 2
Ligand
BDBM123865
Substrate
Meas. Tech.
Immunofluorescence Resonance Energy Transfer (FRET) Assay
pH
4.5±n/a
IC50
650±n/a nM
Comments
extracted
Citation
 Gabellieri, EGuba, WHilpert, HMauser, HMayweg, AVRogers-Evans, MRombach, DThomas, AWoltering, TWostl, W 1,4-oxazepines as BACE1 and/or BACE2 inhibitors US Patent  US8748418 Publication Date 6/10/2014 
Target
Name:
Beta-secretase 2
Synonyms:
AEPLC ASP1 Asp 1 Aspartyl protease 1 BACE2_HUMAN Beta-secretase (BACE) Beta-secretase 2 (BACE-2) Beta-site APP-cleaving enzyme 2 Memapsin-1 beta-Secretase (BACE-2)
Type:
Protein
Mol. Mass.:
56171.20
Organism:
Homo sapiens (Human)
Description:
Q9Y5Z0
Residue:
518
  
Inhibitor
Name:
BDBM123865
Synonyms:
US8748418, 9
Type:
Small organic molecule
Emp. Form.:
C20H20ClF3N4O
Mol. Mass.:
424.847
SMILES:
C[C@@]1(N=C(N)COCC1(F)F)c1cc(N[C@@H]2CCc3cc(Cl)cnc23)ccc1F
: