Target
Prostaglandin E2 receptor EP4 subtype
Ligand
BDBM285492
Substrate
Meas. Tech.
EP4 Antagonistic Activity Measurement
Temperature
298.15±n/a K
IC50
4.50±n/a nM
Comments
extracted
Citation
 Asada, MTani, KHirobe, MHiguchi, SFuchibe, KOikawa, RKotani, TTakano, H Tricyclic spiro compound US Patent  US10077247 Publication Date 9/18/2018 
Target
Name:
Prostaglandin E2 receptor EP4 subtype
Synonyms:
PE2R4_HUMAN PGE2 receptor EP4 subtype PTGER4 Prostanoid EP4 receptor
Type:
Enzyme
Mol. Mass.:
53134.53
Organism:
Homo sapiens (Human)
Description:
P35408
Residue:
488
  
Inhibitor
Name:
BDBM285492
Synonyms:
4-[4-Cyano-2-({[(2′R,4S)-6-(1H-pyrrolo[2,3-b]pyridin-5-yl)-2,3-dihydrospiro[chromene-4,1′-cyclopropan]-2′-yl]carbonyl}amino)phenyl]butanoic acid | US10077247, Example 7-19
Type:
Small organic molecule
Emp. Form.:
C30H26N4O4
Mol. Mass.:
506.5518
SMILES:
OC(=O)CCCc1ccc(cc1NC(=O)[C@@H]1C[C@]11CCOc2ccc(cc12)-c1cnc2[nH]ccc2c1)C#N
: