Target
Isocitrate dehydrogenase [NADP] cytoplasmic
Ligand
BDBM146460
Substrate
Meas. Tech.
LC-MS Biochemical Assay
pH
7.4±n/a
Temperature
298.15±n/a K
IC50
138±n/a nM
Comments
extracted
Citation
 Caferro, TRCho, YSCostales, AQLei, HLenoir, FLevell, JRLiu, GPalermo, MGPfister, KBSendzik, MShafer, CShultz, MDSmith, TSutton, JCToure, BYang, FZhao, Q 3-pyrimidin-4-yl-oxazolidin-2-ones as inhibitors of mutant IDH US Patent  US8957068 Publication Date 2/17/2015 
Target
Name:
Isocitrate dehydrogenase [NADP] cytoplasmic
Synonyms:
Cytosolic NADP-isocitrate dehydrogenase IDH1 IDP Isocitrate dehydrogenase 1 (IDH1) Oxalosuccinate decarboxylase | PICD
Type:
Protein
Mol. Mass.:
46661.29
Organism:
Homo sapiens (Human)
Description:
O75874
Residue:
414
  
Inhibitor
Name:
BDBM146460
Synonyms:
US8957068, 592
Type:
Small organic molecule
Emp. Form.:
C24H30FN5O4
Mol. Mass.:
471.5245
SMILES:
CC(C)[C@H]1COC(=O)N1c1ccnc(N[C@@H](C)c2ccc(C(=O)NC3CCOCC3)c(F)c2)n1
: