Target
Tyrosine-protein kinase JAK3
Ligand
BDBM151043
Substrate
Meas. Tech.
Kinase Assay
pH
7.4±n/a
Temperature
298.15±n/a K
IC50
1±n/a nM
Comments
extracted
Citation
 Wrobleski, STDas, JDuan, JGuo, JHynes, JJiang, BKempson, JLin, SLu, ZPitts, WJSpergel, SHWu, HYang, BV Pyrrolopyridazine JAK3 inhibitors and their use for the treatment of inflammatory and autoimmune diseases US Patent  US8987268 Publication Date 3/24/2015 
Target
Name:
Tyrosine-protein kinase JAK3
Synonyms:
JAK-3 JAK3_HUMAN Janus kinase 3 (JAK3) L-JAK | Leukocyte janus kinase
Type:
Protein
Mol. Mass.:
125111.08
Organism:
Homo sapiens (Human)
Description:
P52333
Residue:
1124
  
Inhibitor
Name:
BDBM151043
Synonyms:
US8987268, 62
Type:
Small organic molecule
Emp. Form.:
C24H30N8O3
Mol. Mass.:
478.5468
SMILES:
C[C@H]1[C@@H](C[C@@H]2CN(C[C@H]12)C(=O)C(C)(C)O)Nc1c(cnn2cc(cc12)-c1cnc(N)nc1)C(N)=O
: