Target
Tyrosine-protein kinase JAK3
Ligand
BDBM151050
Substrate
Meas. Tech.
Kinase Assay
pH
7.4±n/a
Temperature
298.15±n/a K
IC50
1.4±n/a nM
Comments
extracted
Citation
 Wrobleski, STDas, JDuan, JGuo, JHynes, JJiang, BKempson, JLin, SLu, ZPitts, WJSpergel, SHWu, HYang, BV Pyrrolopyridazine JAK3 inhibitors and their use for the treatment of inflammatory and autoimmune diseases US Patent  US8987268 Publication Date 3/24/2015 
Target
Name:
Tyrosine-protein kinase JAK3
Synonyms:
JAK-3 JAK3_HUMAN Janus kinase 3 (JAK3) L-JAK | Leukocyte janus kinase
Type:
Protein
Mol. Mass.:
125111.08
Organism:
Homo sapiens (Human)
Description:
P52333
Residue:
1124
  
Inhibitor
Name:
BDBM151050
Synonyms:
US8987268, 97
Type:
Small organic molecule
Emp. Form.:
C24H27FN6O2
Mol. Mass.:
450.5086
SMILES:
CCC(=O)N1C[C@H]2C[C@@H](Nc3c(cnn4cc(cc34)-c3ccc(F)nc3)C(N)=O)[C@H](C)[C@H]2C1
: