Target
Tyrosine-protein kinase JAK3
Ligand
BDBM151085
Substrate
Meas. Tech.
Kinase Assay
pH
7.4±n/a
Temperature
298.15±n/a K
IC50
0.5±n/a nM
Comments
extracted
Citation
 Wrobleski, STDas, JDuan, JGuo, JHynes, JJiang, BKempson, JLin, SLu, ZPitts, WJSpergel, SHWu, HYang, BV Pyrrolopyridazine JAK3 inhibitors and their use for the treatment of inflammatory and autoimmune diseases US Patent  US8987268 Publication Date 3/24/2015 
Target
Name:
Tyrosine-protein kinase JAK3
Synonyms:
JAK-3 JAK3_HUMAN Janus kinase 3 (JAK3) L-JAK | Leukocyte janus kinase
Type:
Protein
Mol. Mass.:
125111.08
Organism:
Homo sapiens (Human)
Description:
P52333
Residue:
1124
  
Inhibitor
Name:
BDBM151085
Synonyms:
US8987268, 188
Type:
Small organic molecule
Emp. Form.:
C24H26ClN9O2
Mol. Mass.:
507.975
SMILES:
CNC(=O)Cn1cc(cn1)-c1cc2c(N[C@@H]3CN(C[C@@H]3C)c3ccc(Cl)cn3)c(cnn2c1)C(N)=O
: