Target
Tyrosine-protein kinase JAK1
Ligand
BDBM151047
Substrate
Meas. Tech.
Kinase Assay
pH
7.4±n/a
Temperature
298.15±n/a K
IC50
0.3±n/a nM
Comments
extracted
Citation
 Wrobleski, STDas, JDuan, JGuo, JHynes, JJiang, BKempson, JLin, SLu, ZPitts, WJSpergel, SHWu, HYang, BV Pyrrolopyridazine JAK3 inhibitors and their use for the treatment of inflammatory and autoimmune diseases US Patent  US8987268 Publication Date 3/24/2015 
Target
Name:
Tyrosine-protein kinase JAK1
Synonyms:
JAK-1 JAK1A JAK1_HUMAN Janus kinase 1 (JAK1) | Janus kinase 1 JAK1
Type:
Protein
Mol. Mass.:
133293.73
Organism:
Homo sapiens (Human)
Description:
P23458
Residue:
1154
  
Inhibitor
Name:
BDBM151047
Synonyms:
US8987268, 70
Type:
Small organic molecule
Emp. Form.:
C28H32N6O4
Mol. Mass.:
516.5915
SMILES:
C[C@H]1[C@@H](C[C@@H]2CN(C[C@H]12)C(=O)CO)Nc1c(cnn2cc(cc12)-c1ccc(cc1)C(=O)NC1CC1)C(N)=O
: