Target
Tyrosine-protein kinase JAK1
Ligand
BDBM151085
Substrate
Meas. Tech.
Kinase Assay
pH
7.4±n/a
Temperature
298.15±n/a K
IC50
0.4±n/a nM
Comments
extracted
Citation
 Wrobleski, STDas, JDuan, JGuo, JHynes, JJiang, BKempson, JLin, SLu, ZPitts, WJSpergel, SHWu, HYang, BV Pyrrolopyridazine JAK3 inhibitors and their use for the treatment of inflammatory and autoimmune diseases US Patent  US8987268 Publication Date 3/24/2015 
Target
Name:
Tyrosine-protein kinase JAK1
Synonyms:
JAK-1 JAK1A JAK1_HUMAN Janus kinase 1 (JAK1) | Janus kinase 1 JAK1
Type:
Protein
Mol. Mass.:
133293.73
Organism:
Homo sapiens (Human)
Description:
P23458
Residue:
1154
  
Inhibitor
Name:
BDBM151085
Synonyms:
US8987268, 188
Type:
Small organic molecule
Emp. Form.:
C24H26ClN9O2
Mol. Mass.:
507.975
SMILES:
CNC(=O)Cn1cc(cn1)-c1cc2c(N[C@@H]3CN(C[C@@H]3C)c3ccc(Cl)cn3)c(cnn2c1)C(N)=O
: