Target
Menin
Ligand
BDBM152211
Substrate
Meas. Tech.
Homogeneous Time-Resolve Fluorescence (HTRF) Assay
IC50
1200±n/a nM
Citation
 Grembecka, JCierpicki, THess, J Compositions and methods for treatment of leukemia US Patent  US8993552 Publication Date 3/31/2015 
Target
Name:
Menin
Synonyms:
MEN1 Menin/Histone-lysine N-methyltransferase MLL | SCG2
Type:
Protein
Mol. Mass.:
68022.55
Organism:
Homo sapiens (Human)
Description:
O00255
Residue:
610
  
Inhibitor
Name:
BDBM152211
Synonyms:
BDBM152229 | US8993552, 1
Type:
Small organic molecule
Emp. Form.:
C19H25N5S2
Mol. Mass.:
387.565
SMILES:
CC1(C)CN=C(S1)N1CCN(CC1)c1ncnc2sc3CCCCc3c12
: