Target
Proteinase-activated receptor 4
Ligand
BDBM286421
Substrate
Meas. Tech.
FLIPR Assay
Temperature
298.15±n/a K
IC50
0.360±n/a nM
Comments
extracted
Citation
 Martel, ATremblay, FMarinier, APriestley, ESPosy, SLLawrence, RMMiller, MM Imidazothiadiazole and imidazopyridazine derivatives as protease activated receptor 4 (PAR4) inhibitors for treating platelet aggregation US Patent  US9518064 Publication Date 12/13/2016 
Target
Name:
Proteinase-activated receptor 4
Synonyms:
Coagulation factor II receptor-like 3 PAR-4 PAR4_HUMAN Proteinase-activated receptor 4 (PAR4) | Thrombin receptor-like 3
Type:
Protein
Mol. Mass.:
41145.16
Organism:
Homo sapiens (Human)
Description:
Q96RI0
Residue:
385
  
Inhibitor
Name:
BDBM286421
Synonyms:
US9518064, Example 37
Type:
Small organic molecule
Emp. Form.:
C28H25N5O5S
Mol. Mass.:
543.594
SMILES:
CCCOc1ncc(cn1)-c1cccc(COc2cc(OC)cc3oc(cc23)-c2cn3nc(OC)sc3n2)c1
: