Target
Proteinase-activated receptor 4
Ligand
BDBM286453
Substrate
Meas. Tech.
FLIPR Assay
Temperature
298.15±n/a K
IC50
0.500±n/a nM
Comments
extracted
Citation
 Martel, ATremblay, FMarinier, APriestley, ESPosy, SLLawrence, RMMiller, MM Imidazothiadiazole and imidazopyridazine derivatives as protease activated receptor 4 (PAR4) inhibitors for treating platelet aggregation US Patent  US9518064 Publication Date 12/13/2016 
Target
Name:
Proteinase-activated receptor 4
Synonyms:
Coagulation factor II receptor-like 3 PAR-4 PAR4_HUMAN Proteinase-activated receptor 4 (PAR4) | Thrombin receptor-like 3
Type:
Protein
Mol. Mass.:
41145.16
Organism:
Homo sapiens (Human)
Description:
Q96RI0
Residue:
385
  
Inhibitor
Name:
BDBM286453
Synonyms:
US9518064, Example 71
Type:
Small organic molecule
Emp. Form.:
C27H23N5O6S
Mol. Mass.:
545.566
SMILES:
COc1nn2cc(nc2s1)-c1cc2c(OCc3cc(OC)cc(c3)-c3cnc(OC)nc3)cc(OC)cc2o1
: