Target
Proteinase-activated receptor 4
Ligand
BDBM286467
Substrate
Meas. Tech.
FLIPR Assay
Temperature
298.15±n/a K
IC50
0.560±n/a nM
Comments
extracted
Citation
 Martel, ATremblay, FMarinier, APriestley, ESPosy, SLLawrence, RMMiller, MM Imidazothiadiazole and imidazopyridazine derivatives as protease activated receptor 4 (PAR4) inhibitors for treating platelet aggregation US Patent  US9518064 Publication Date 12/13/2016 
Target
Name:
Proteinase-activated receptor 4
Synonyms:
Coagulation factor II receptor-like 3 PAR-4 PAR4_HUMAN Proteinase-activated receptor 4 (PAR4) | Thrombin receptor-like 3
Type:
Protein
Mol. Mass.:
41145.16
Organism:
Homo sapiens (Human)
Description:
Q96RI0
Residue:
385
  
Inhibitor
Name:
BDBM286467
Synonyms:
2-Methoxy-6-(6-methoxy-4-((3-(5-(1-((tetrahydro-2H-pyran-2-yl)oxy)ethyl)pyridin-2-yl)benzyl)oxy)benzofuran-2-yl)imidazo[2,1-b][1,3,4]thiadiazole | US9518064, Example 86
Type:
Small organic molecule
Emp. Form.:
C33H32N4O6S
Mol. Mass.:
612.695
SMILES:
COc1nn2cc(nc2s1)-c1cc2c(OCc3cccc(c3)-c3ccc(cn3)C(C)OC3CCCCO3)cc(OC)cc2o1
: