Target
Proteinase-activated receptor 4
Ligand
BDBM286479
Substrate
Meas. Tech.
FLIPR Assay
Temperature
298.15±n/a K
IC50
0.290±n/a nM
Comments
extracted
Citation
 Martel, ATremblay, FMarinier, APriestley, ESPosy, SLLawrence, RMMiller, MM Imidazothiadiazole and imidazopyridazine derivatives as protease activated receptor 4 (PAR4) inhibitors for treating platelet aggregation US Patent  US9518064 Publication Date 12/13/2016 
Target
Name:
Proteinase-activated receptor 4
Synonyms:
Coagulation factor II receptor-like 3 PAR-4 PAR4_HUMAN Proteinase-activated receptor 4 (PAR4) | Thrombin receptor-like 3
Type:
Protein
Mol. Mass.:
41145.16
Organism:
Homo sapiens (Human)
Description:
Q96RI0
Residue:
385
  
Inhibitor
Name:
BDBM286479
Synonyms:
US9518064, Example 98
Type:
Small organic molecule
Emp. Form.:
C28H24N6O5S
Mol. Mass.:
556.592
SMILES:
COc1nn2cc(nc2s1)-c1cc2c(OCc3ccnc(n3)-c3ccc(cc3)C(=O)N(C)C)cc(OC)cc2o1
: