Target
Proteinase-activated receptor 4
Ligand
BDBM286491
Substrate
Meas. Tech.
FLIPR Assay
Temperature
298.15±n/a K
IC50
0.410±n/a nM
Comments
extracted
Citation
 Martel, ATremblay, FMarinier, APriestley, ESPosy, SLLawrence, RMMiller, MM Imidazothiadiazole and imidazopyridazine derivatives as protease activated receptor 4 (PAR4) inhibitors for treating platelet aggregation US Patent  US9518064 Publication Date 12/13/2016 
Target
Name:
Proteinase-activated receptor 4
Synonyms:
Coagulation factor II receptor-like 3 PAR-4 PAR4_HUMAN Proteinase-activated receptor 4 (PAR4) | Thrombin receptor-like 3
Type:
Protein
Mol. Mass.:
41145.16
Organism:
Homo sapiens (Human)
Description:
Q96RI0
Residue:
385
  
Inhibitor
Name:
BDBM286491
Synonyms:
(S)-4-(6-(((2-(2-(1-Fluoroethyl)imidazo[2,1-b][1,3,4]thiadiazol-6-yl)-6-methoxybenzofuran-4-yl)oxy)methyl)pyridin-2-yl)tetrahydro-2H-pyran-4-ol | US9518064, Example 110
Type:
Small organic molecule
Emp. Form.:
C26H25FN4O5S
Mol. Mass.:
524.564
SMILES:
COc1cc(OCc2cccc(n2)C2(O)CCOCC2)c2cc(oc2c1)-c1cn2nc(sc2n1)[C@H](C)F
: