Target
Alpha-glucosidase MAL12
Ligand
BDBM152497
Substrate
Meas. Tech.
alpha-Glucosidase Assay
IC50
2.2e+3± 2.5e+2 nM
Citation
 Rahim, FMalik, FUllah, HWadood, AKhan, FJavid, MTTaha, MRehman, WUr Rehman, AKhan, KM Isatin based Schiff bases as inhibitors of a-glucosidase: Synthesis, characterization, in vitro evaluation and molecular docking studies. Bioorg Chem 60:42-8 (2015)  
Target
Name:
Alpha-glucosidase MAL12
Synonyms:
α-Glucosidase MAL12_YEAST Maltase | alpha-Glucosidase (α-Glucosidase)
Type:
Protein
Mol. Mass.:
68084.32
Organism:
Saccharomyces cerevisiae
Description:
P53341
Residue:
584
  
Inhibitor
Name:
BDBM152497
Synonyms:
(E)-N'-(6-Bromo-2-oxoindolin-3-ylidene)-2-(2,4-dichlorophenyl)acetohydrazide (12)
Type:
Small organic molecule
Emp. Form.:
C16H10BrCl2N3O2
Mol. Mass.:
427.08
SMILES:
Clc1ccc(CC(=O)N\N=C2\C(=O)Nc3cc(Br)ccc23)c(Cl)c1
: