Target
Beta-secretase 1
Ligand
BDBM156243
Substrate
Meas. Tech.
Fluorescence Quench Assay
pH
4.4±n/a
IC50
2.6±n/a nM
Comments
extracted
Citation
 Bukhtiyarov, YCacatian, SDillard, LWFuchs, KJia, LLala, DSMorales-Ramos, ASingh, SBVenkatraman, SXu, ZYuan, JZhao, YZheng, YDorner-Ciossek, CGross, UHeine, NSauer, A Inhibitors of beta-secretase US Patent  US9018391 Publication Date 4/28/2015 
Target
Name:
Beta-secretase 1
Synonyms:
ASP2 Aspartyl protease 2 BACE1 Beta-secretase (BACE) Beta-secretase 1 (BACE 1) Beta-secretase 1 (BACE1) Beta-site amyloid precursor protein cleaving enzyme 1 Memapsin-2 beta-Secretase (BACE-1) | beta-Secretase (BACE1)
Type:
Protein
Mol. Mass.:
55755.10
Organism:
Homo sapiens (Human)
Description:
P56817
Residue:
501
  
Inhibitor
Name:
BDBM156243
Synonyms:
US9018391, 5
Type:
Small organic molecule
Emp. Form.:
C26H32FN5O2
Mol. Mass.:
465.563
SMILES:
C[C@H]1C[C@]2(Cc3ccc(cc3[C@]22N=C(N)N(CC(C)(C)F)C2=O)-c2cncnc2)C[C@@H](C)[C@@H]1O
: