Target
High affinity nerve growth factor receptor
Ligand
BDBM406105
Substrate
Meas. Tech.
Kinase Binding Assay
IC50
<100±n/a nM
Citation
 Allen, SAndrews, SWBlake, JFBrandhuber, BJHaas, JJiang, YKercher, TKolakowski, GRThomas, AAWinski, SL Bicyclic urea, thiourea, guanidine and cyanoguanidine compounds useful for the treatment of pain US Patent  US10351575 Publication Date 7/16/2019 
Target
Name:
High affinity nerve growth factor receptor
Synonyms:
2.7.10.1 NTRK1 NTRK1_HUMAN Neurotrophic tyrosine kinase receptor type 1 Synonyms=MTC TRK1-transforming tyrosine kinase protein TRKA GN Trk-A Tropomyosin-related kinase A Tyrosine kinase receptor Tyrosine kinase receptor A Tyrosine kinase receptor A (Trk-A) gp140trk | p140-TrkA
Type:
Mol. Mass.:
87498.18
Organism:
Homo sapiens (Human)
Description:
P04629
Residue:
796
  
Inhibitor
Name:
BDBM406105
Synonyms:
US10351575, Example 58
Type:
Small organic molecule
Emp. Form.:
C26H24F2N6O2
Mol. Mass.:
490.5046
SMILES:
Cc1c(NC(=O)NC2[C@H](O)C3(CC3)c3cc(F)c(F)cc23)n(nc1-c1cnn(C)c1)-c1ccccc1
: