Target
Apoptosis regulator Bcl-2
Ligand
BDBM161559
Substrate
Meas. Tech.
Fluorescence Polarisation Assay
pH
7.4±n/a
IC50
3.4±n/a nM
Comments
extracted
Citation
 Le Tiran, ALe Diguarher, TStarck, JHenlin, JGuillouzic, ADe Nanteuil, GGeneste, OFejes, ITatai, JNyerges, MDavidson, JEMurray, JBChen, IDurand, D Pyrrole compounds, a process for their preparation and pharmaceutical compositions containing them US Patent  US9108983 Publication Date 8/18/2015 
Target
Name:
Apoptosis regulator Bcl-2
Synonyms:
Apoptosis regulator Bcl-2 Protein BCL-2 BCL2_HUMAN | Bcl-2 Protein
Type:
Homodimer or heterodimer
Mol. Mass.:
26269.11
Organism:
Homo sapiens (Human)
Description:
P10415
Residue:
239
  
Inhibitor
Name:
BDBM161559
Synonyms:
US9108983, Example 122
Type:
Small organic molecule
Emp. Form.:
C40H41ClN6O4
Mol. Mass.:
705.244
SMILES:
Cc1c(cc(-c2cc(Cl)ccc2C(=O)N2Cc3ccccc3C[C@H]2CN2CCOCC2)n1C)C(=O)N(c1cnn(c1)C1CC1)c1ccc(O)cc1
: