Target
Apoptosis regulator Bcl-2
Ligand
BDBM161614
Substrate
Meas. Tech.
Fluorescence Polarisation Assay
pH
7.4±n/a
IC50
3±n/a nM
Comments
extracted
Citation
 Le Tiran, ALe Diguarher, TStarck, JHenlin, JGuillouzic, ADe Nanteuil, GGeneste, OFejes, ITatai, JNyerges, MDavidson, JEMurray, JBChen, IDurand, D Pyrrole compounds, a process for their preparation and pharmaceutical compositions containing them US Patent  US9108983 Publication Date 8/18/2015 
Target
Name:
Apoptosis regulator Bcl-2
Synonyms:
Apoptosis regulator Bcl-2 Protein BCL-2 BCL2_HUMAN | Bcl-2 Protein
Type:
Homodimer or heterodimer
Mol. Mass.:
26269.11
Organism:
Homo sapiens (Human)
Description:
P10415
Residue:
239
  
Inhibitor
Name:
BDBM161614
Synonyms:
US9108983, Example 431
Type:
Small organic molecule
Emp. Form.:
C39H41ClN6O4
Mol. Mass.:
693.234
SMILES:
Cc1nn(C)cc1N(C(=O)c1cc(-c2cc(Cl)ccc2C(=O)N2Cc3ccccc3C[C@H]2CN2CCOCC2)n(C)c1C)c1ccc(O)cc1
: