Target
Urease subunit alpha
Ligand
BDBM173607
Substrate
Meas. Tech.
Urease Inhibition Assay
pH
7±n/a
IC50
1.73e+3± 1 nM
Comments
extracted
Citation
 Rahim, FZaman, KUllah, HTaha, MWadood, AJaved, MTRehman, WAshraf, MUddin, RUddin, IAsghar, HKhan, AAKhan, KM Synthesis of 4-thiazolidinone analogs as potent in vitro anti-urease agents. Bioorg Chem 63:123-31 (2015)  
Target
Name:
Urease subunit alpha
Synonyms:
URE1_SPOPA Urease | ureC
Type:
Enzyme Subunit
Mol. Mass.:
61384.55
Organism:
Bacillus pasteurii
Description:
Residue:
569
  
Inhibitor
Name:
BDBM173607
Synonyms:
(Z)-2-((Z)-(Napthalen-1-ylmethylene)hydrazono)thiazolodin-4-one (20)
Type:
Small organic molecule
Emp. Form.:
C12H12BrN3O3S
Mol. Mass.:
358.211
SMILES:
COc1cc(\C=N/N=C2\NC(=O)CS2)c(OC)cc1Br
: