Target
Hepatocyte growth factor receptor
Ligand
BDBM180270
Substrate
Meas. Tech.
Kinase Assay
pH
7±n/a
Temperature
298.15±n/a K
IC50
19±n/a nM
Comments
extracted
Citation
 Xi, N Substituted quinoline compounds and methods of use US Patent  US9133162 Publication Date 9/15/2015 
Target
Name:
Hepatocyte growth factor receptor
Synonyms:
Hepatocyte growth factor receptor Hepatocyte growth factor receptor (c-MET) MET Met proto-oncogene (hepatocyte growth factor receptor) Tyrosine-protein kinase Met (c-Met) c-Met kinase
Type:
Protein
Mol. Mass.:
155559.73
Organism:
Homo sapiens (Human)
Description:
P08581
Residue:
1390
  
Inhibitor
Name:
BDBM180270
Synonyms:
US9133162, Example 1
Type:
Small organic molecule
Emp. Form.:
C31H29FN4O5
Mol. Mass.:
556.5842
SMILES:
Cc1c(C(=O)Nc2ccc(Oc3ccnc4cc(OCC(C)(C)O)ccc34)c(F)c2)c(=O)n(-c2ccccc2)n1C
: