Target
Hepatocyte growth factor receptor
Ligand
BDBM180271
Substrate
Meas. Tech.
Kinase Assay
pH
7±n/a
Temperature
298.15±n/a K
IC50
7±n/a nM
Comments
extracted
Citation
 Xi, N Substituted quinoline compounds and methods of use US Patent  US9133162 Publication Date 9/15/2015 
Target
Name:
Hepatocyte growth factor receptor
Synonyms:
Hepatocyte growth factor receptor Hepatocyte growth factor receptor (c-MET) MET Met proto-oncogene (hepatocyte growth factor receptor) Tyrosine-protein kinase Met (c-Met) c-Met kinase
Type:
Protein
Mol. Mass.:
155559.73
Organism:
Homo sapiens (Human)
Description:
P08581
Residue:
1390
  
Inhibitor
Name:
BDBM180271
Synonyms:
US9133162, Example 2
Type:
Small organic molecule
Emp. Form.:
C30H27FN4O5
Mol. Mass.:
542.5576
SMILES:
C[C@@H](O)COc1ccc2c(Oc3ccc(NC(=O)c4c(C)n(C)n(-c5ccccc5)c4=O)cc3F)ccnc2c1
: