Target
Bifunctional epoxide hydrolase 2
Ligand
BDBM181769
Substrate
Meas. Tech.
Enzyme Assay
pH
7±n/a
Temperature
298.15±n/a K
IC50
241±n/a nM
Comments
extracted
Citation
 Ceccarelli, SMGuerot, CKnust, H Azetidine compounds, compositions and methods of use US Patent  US9139593 Publication Date 9/22/2015 
Target
Name:
Bifunctional epoxide hydrolase 2
Synonyms:
Cytosolic epoxide hydrolase 2 EPHX2 HYES_HUMAN Soluble epoxide hydrolase (sEH) | epoxide hydrolase 2, cytoplasmic
Type:
Enzyme
Mol. Mass.:
62613.07
Organism:
Homo sapiens (Human)
Description:
P34913
Residue:
555
  
Inhibitor
Name:
BDBM181769
Synonyms:
US9139593, 1
Type:
Small organic molecule
Emp. Form.:
C20H19Cl2N3O2
Mol. Mass.:
404.29
SMILES:
Clc1ccc(CNC(=O)N2CC3(C2)CN(C3)C(=O)c2ccccc2)c(Cl)c1
: