Target
Bifunctional epoxide hydrolase 2
Ligand
BDBM181780
Substrate
Meas. Tech.
Enzyme Assay
pH
7±n/a
Temperature
298.15±n/a K
IC50
243±n/a nM
Comments
extracted
Citation
 Ceccarelli, SMGuerot, CKnust, H Azetidine compounds, compositions and methods of use US Patent  US9139593 Publication Date 9/22/2015 
Target
Name:
Bifunctional epoxide hydrolase 2
Synonyms:
Cytosolic epoxide hydrolase 2 EPHX2 HYES_HUMAN Soluble epoxide hydrolase (sEH) | epoxide hydrolase 2, cytoplasmic
Type:
Enzyme
Mol. Mass.:
62613.07
Organism:
Homo sapiens (Human)
Description:
P34913
Residue:
555
  
Inhibitor
Name:
BDBM181780
Synonyms:
US9139593, 12
Type:
Small organic molecule
Emp. Form.:
C20H19ClF3N3O4S
Mol. Mass.:
489.896
SMILES:
FC(F)(F)Oc1ccccc1CNC(=O)N1CC2(CCN2S(=O)(=O)c2ccc(Cl)cc2)C1
: