Target
Bifunctional epoxide hydrolase 2
Ligand
BDBM181784
Substrate
Meas. Tech.
Enzyme Assay
pH
7±n/a
Temperature
298.15±n/a K
IC50
2689±n/a nM
Comments
extracted
Citation
 Ceccarelli, SMGuerot, CKnust, H Azetidine compounds, compositions and methods of use US Patent  US9139593 Publication Date 9/22/2015 
Target
Name:
Bifunctional epoxide hydrolase 2
Synonyms:
Cytosolic epoxide hydrolase 2 EPHX2 HYES_HUMAN Soluble epoxide hydrolase (sEH) | epoxide hydrolase 2, cytoplasmic
Type:
Enzyme
Mol. Mass.:
62613.07
Organism:
Homo sapiens (Human)
Description:
P34913
Residue:
555
  
Inhibitor
Name:
BDBM181784
Synonyms:
US9139593, 16
Type:
Small organic molecule
Emp. Form.:
C20H20Cl3N3O3S
Mol. Mass.:
488.815
SMILES:
Clc1ccc(cc1)S(=O)(=O)N1C[C@]2(CC[C@H]2NC(=O)NCc2ccc(Cl)cc2Cl)C1
: