Target
Serine/threonine-protein kinase B-raf
Ligand
BDBM185591
Substrate
Meas. Tech.
Kinase Activity
IC50
56±n/a nM
Citation
 Bae, IHSon, JBHan, SMKwak, EJKim, HSSong, JYByun, EYJun, SAAhn, YGSuh, KH Thieno[3,2-D]pyrimidine derivatives having inhibitory activity for protein kinases US Patent  US9156852 Publication Date 10/13/2015 
Target
Name:
Serine/threonine-protein kinase B-raf
Synonyms:
B-RAF B-Raf proto-oncogene serine/threonine-protein kinase BRAF1 RAFB1 v-Raf murine sarcoma viral oncogene homolog B1
Type:
Serine/threonine-protein kinase
Mol. Mass.:
84446.00
Organism:
Homo sapiens (Human)
Description:
P15056
Residue:
766
  
Inhibitor
Name:
BDBM185591
Synonyms:
US9156852, 116 | USRE47451, Example 116
Type:
Small organic molecule
Emp. Form.:
C23H16ClFN6OS
Mol. Mass.:
478.929
SMILES:
Cc1ccc2c(Nc3cccc(Cl)c3F)nccc2c1NC(=O)c1csc2c(N)ncnc12
: