Target
Serine/threonine-protein kinase B-raf [V600E]
Ligand
BDBM185585
Substrate
Meas. Tech.
Kinase Activity
IC50
32±n/a nM
Citation
 Bae, IHSon, JBHan, SMKwak, EJKim, HSSong, JYByun, EYJun, SAAhn, YGSuh, KH Thieno[3,2-D]pyrimidine derivatives having inhibitory activity for protein kinases US Patent  US9156852 Publication Date 10/13/2015 
Target
Name:
Serine/threonine-protein kinase B-raf [V600E]
Synonyms:
B-RAF V600E B-Raf Protein Kinase Mutant (V600E) BRAF BRAF mutant V600E BRAF_HUMAN Protein mono-ADP-ribosyltransferase (PARP3) RAFB1 Serine/threonine-protein kinase B-raf (V600E) V-RAF murine sarcoma viral oncogene homologue B1 mutant (BRAF V600E)
Type:
Mol. Mass.:
84474.98
Organism:
Homo sapiens (Human)
Description:
P15056 V600E
Residue:
766
  
Inhibitor
Name:
BDBM185585
Synonyms:
US9156852, 16 | USRE47451, Example 16
Type:
Small organic molecule
Emp. Form.:
C24H20N6O2S
Mol. Mass.:
456.52
SMILES:
COc1ccc(Nc2nccc3c(NC(=O)c4csc5c(N)ncnc45)c(C)ccc23)cc1
: