Target
RAF proto-oncogene serine/threonine-protein kinase
Ligand
BDBM185587
Substrate
Meas. Tech.
Kinase Activity
IC50
32±n/a nM
Citation
 Bae, IHSon, JBHan, SMKwak, EJKim, HSSong, JYByun, EYJun, SAAhn, YGSuh, KH Thieno[3,2-D]pyrimidine derivatives having inhibitory activity for protein kinases US Patent  US9156852 Publication Date 10/13/2015 
Target
Name:
RAF proto-oncogene serine/threonine-protein kinase
Synonyms:
C-Raf Protein Kinase RAF RAF1 Raf-1 Serine/threonine-protein kinase C-Raf | cRaf
Type:
Serine/threonine-protein kinase
Mol. Mass.:
73082.52
Organism:
Homo sapiens (Human)
Description:
P04049
Residue:
648
  
Inhibitor
Name:
BDBM185587
Synonyms:
US9156852, 50 | USRE47451, Example 50
Type:
Small organic molecule
Emp. Form.:
C24H18F2N6O2S
Mol. Mass.:
492.501
SMILES:
Cc1ccc2c(Nc3ccc(OC(F)F)cc3)nccc2c1NC(=O)c1csc2c(N)ncnc12
: