Target
RAF proto-oncogene serine/threonine-protein kinase
Ligand
BDBM185591
Substrate
Meas. Tech.
Kinase Activity
IC50
5±n/a nM
Citation
 Bae, IHSon, JBHan, SMKwak, EJKim, HSSong, JYByun, EYJun, SAAhn, YGSuh, KH Thieno[3,2-D]pyrimidine derivatives having inhibitory activity for protein kinases US Patent  US9156852 Publication Date 10/13/2015 
Target
Name:
RAF proto-oncogene serine/threonine-protein kinase
Synonyms:
C-Raf Protein Kinase RAF RAF1 Raf-1 Serine/threonine-protein kinase C-Raf | cRaf
Type:
Serine/threonine-protein kinase
Mol. Mass.:
73082.52
Organism:
Homo sapiens (Human)
Description:
P04049
Residue:
648
  
Inhibitor
Name:
BDBM185591
Synonyms:
US9156852, 116 | USRE47451, Example 116
Type:
Small organic molecule
Emp. Form.:
C23H16ClFN6OS
Mol. Mass.:
478.929
SMILES:
Cc1ccc2c(Nc3cccc(Cl)c3F)nccc2c1NC(=O)c1csc2c(N)ncnc12
: