Target
Macrophage colony-stimulating factor 1 receptor
Ligand
BDBM185591
Substrate
Meas. Tech.
Kinase Activity
IC50
10±n/a nM
Citation
 Bae, IHSon, JBHan, SMKwak, EJKim, HSSong, JYByun, EYJun, SAAhn, YGSuh, KH Thieno[3,2-D]pyrimidine derivatives having inhibitory activity for protein kinases US Patent  US9156852 Publication Date 10/13/2015 
Target
Name:
Macrophage colony-stimulating factor 1 receptor
Synonyms:
CSF1R FMS Macrophage colony stimulating factor receptor Macrophage colony-stimulating factor 1 receptor (c-FMS) Proto-oncogene c-Fms c-fms | cFMS
Type:
Protein
Mol. Mass.:
107979.48
Organism:
Homo sapiens (Human)
Description:
P07333
Residue:
972
  
Inhibitor
Name:
BDBM185591
Synonyms:
US9156852, 116 | USRE47451, Example 116
Type:
Small organic molecule
Emp. Form.:
C23H16ClFN6OS
Mol. Mass.:
478.929
SMILES:
Cc1ccc2c(Nc3cccc(Cl)c3F)nccc2c1NC(=O)c1csc2c(N)ncnc12
: