Target
Epithelial discoidin domain-containing receptor 1
Ligand
BDBM185586
Substrate
Meas. Tech.
Kinase Activity
IC50
40±n/a nM
Citation
 Bae, IHSon, JBHan, SMKwak, EJKim, HSSong, JYByun, EYJun, SAAhn, YGSuh, KH Thieno[3,2-D]pyrimidine derivatives having inhibitory activity for protein kinases US Patent  US9156852 Publication Date 10/13/2015 
Target
Name:
Epithelial discoidin domain-containing receptor 1
Synonyms:
CAK DDR1_HUMAN Discoidin domain-containing receptor 1 (DDR1) EDDR1 Epithelial discoidin domain receptor 1 (DDR1) Epithelial discoidin domain-containing receptor 1 (DDR1) Mammary carcinoma kinase 10 NTRK4 Protein-tyrosine kinase RTK 6 TRKE | Tyrosine-protein kinase CAK
Type:
Tyrosine-protein kinase
Mol. Mass.:
101130.02
Organism:
Homo sapiens (Human)
Description:
Q08345
Residue:
913
  
Inhibitor
Name:
BDBM185586
Synonyms:
US9156852, 38 | USRE47451, Example 38
Type:
Small organic molecule
Emp. Form.:
C23H17ClN6OS
Mol. Mass.:
460.939
SMILES:
Cc1ccc2c(Nc3cccc(Cl)c3)nccc2c1NC(=O)c1csc2c(N)ncnc12
: