Target
Lipoxygenase
Ligand
BDBM192703
Substrate
Meas. Tech.
In-vitro LOX Inhibition Assay
pH
9±n/a
Temperature
298.15±n/a K
IC50
2.792±0.243 nM
Comments
extracted
Citation
 Srivastava, PVyas, VKVariya, BPatel, PQureshi, GGhate, M Synthesis, anti-inflammatory, analgesic, 5-lipoxygenase (5-LOX) inhibition activities, and molecular docking study of 7-substituted coumarin derivatives. Bioorg Chem 67:130-8 (2016)  
Target
Name:
Lipoxygenase
Synonyms:
5-Lipoxygenase (5-LOX)
Type:
Protein
Mol. Mass.:
97266.07
Organism:
Glycine max (Soybean)
Description:
Residue:
866
  
Inhibitor
Name:
BDBM192703
Synonyms:
7-(3-(6-chlorobenzo[d]thiazol-2-ylamino)-2-hydroxypropoxy)-4-methyl-2H-chromen-2-one (33)
Type:
Small organic molecule
Emp. Form.:
C20H17ClN2O4S
Mol. Mass.:
416.878
SMILES:
Cc1cc(=O)oc2cc(OCC(O)CNc3nc4ccc(Cl)cc4s3)ccc12
: