Target
Beta-secretase 1 [1-458]
Ligand
BDBM195108
Substrate
Meas. Tech.
BACE Enzyme Assay (Ex.435)
pH
4.4±n/a
IC50
42.5±n/a nM
Comments
extracted
Citation
 Cacatian, SClaremon, DADillard, LWFuchs, KHeine, NJia, LLeftheris, KMcKeever, BMorales-Ramos, ASingh, SBVenkatraman, SWu, GWu, ZXu, ZYuan, JZheng, Y Inhibitors of beta-secretase US Patent  US9212153 Publication Date 12/15/2015 
Target
Name:
Beta-secretase 1 [1-458]
Synonyms:
BACE BACE1_HUMAN KIAA1149
Type:
Mol. Mass.:
50753.53
Organism:
Homo sapiens (Human)
Description:
Truncation 1-458 aa with His-tag at C-terminus
Residue:
458
  
Inhibitor
Name:
BDBM195108
Synonyms:
US10336717, Compound 167 | US9212153, 167,Ex. 129
Type:
Small organic molecule
Emp. Form.:
C28H36N4O2
Mol. Mass.:
460.611
SMILES:
CCCc1cncc(c1)-c1ccc2CC3(CCC(CC3)OC)C3(N=C(N)N(C(C)C)C3=O)c2c1
: