Target
Beta-secretase 1 [1-458]
Ligand
BDBM195115
Substrate
Meas. Tech.
BACE Enzyme Assay (Ex.435)
pH
4.4±n/a
IC50
23.5±n/a nM
Comments
extracted
Citation
 Cacatian, SClaremon, DADillard, LWFuchs, KHeine, NJia, LLeftheris, KMcKeever, BMorales-Ramos, ASingh, SBVenkatraman, SWu, GWu, ZXu, ZYuan, JZheng, Y Inhibitors of beta-secretase US Patent  US9212153 Publication Date 12/15/2015 
Target
Name:
Beta-secretase 1 [1-458]
Synonyms:
BACE BACE1_HUMAN KIAA1149
Type:
Mol. Mass.:
50753.53
Organism:
Homo sapiens (Human)
Description:
Truncation 1-458 aa with His-tag at C-terminus
Residue:
458
  
Inhibitor
Name:
BDBM195115
Synonyms:
US9212153, 174,Ex. 136
Type:
Small organic molecule
Emp. Form.:
C24H33N3O3
Mol. Mass.:
411.5371
SMILES:
COC1CCC2(Cc3ccc(OCC4CC4)cc3[C@]22N=C(N)N(C(C)C)C2=O)CC1
: