Target
Beta-secretase 1 [1-458]
Ligand
BDBM195388
Substrate
Meas. Tech.
BACE Enzyme Assay (Ex.434)
pH
4.5±n/a
Temperature
298.15±n/a K
IC50
869.5±n/a nM
Comments
extracted
Citation
 Cacatian, SClaremon, DADillard, LWFuchs, KHeine, NJia, LLeftheris, KMcKeever, BMorales-Ramos, ASingh, SBVenkatraman, SWu, GWu, ZXu, ZYuan, JZheng, Y Inhibitors of beta-secretase US Patent  US9212153 Publication Date 12/15/2015 
Target
Name:
Beta-secretase 1 [1-458]
Synonyms:
BACE BACE1_HUMAN KIAA1149
Type:
Mol. Mass.:
50753.53
Organism:
Homo sapiens (Human)
Description:
Truncation 1-458 aa with His-tag at C-terminus
Residue:
458
  
Inhibitor
Name:
BDBM195388
Synonyms:
US10336717, Compound 471 | US9212153, 471,Ex. 405
Type:
Small organic molecule
Emp. Form.:
C25H20N6O
Mol. Mass.:
420.4659
SMILES:
CN1C(N)=NC2(C1=O)c1cc(ccc1CC21Cc2cnncc2C1)-c1cccc(c1)C#N
: