Target
Liver carboxylesterase 1
Ligand
BDBM195577
Substrate
Meas. Tech.
Gel-based ABPP (CES1)
pH
7.5±n/a
IC50
1.9e+4±n/a nM
Comments
extracted
Citation
 Ahn, KBoehm, MBrown, MFCalloway, JChe, YChen, JFennell, KFGeoghegan, KFGilbert, AMGutierrez, JAKalgutkar, ASLanba, ALimberakis, CMagee, TVO'Doherty, IOliver, RPabst, BPandit, JParris, KPfefferkorn, JARolph, TPPatel, RSchuff, BShanmugasundaram, VStarr, JTVarghese, AHVera, NBVernochet, CYan, J Discovery of a Selective Covalent Inhibitor of Lysophospholipase-like 1 (LYPLAL1) as a Tool to Evaluate the Role of this Serine Hydrolase in Metabolism. ACS Chem Biol 11:2529-40 (2016)  
Target
Name:
Liver carboxylesterase 1
Synonyms:
Acyl coenzyme A:cholesterol acyltransferase CES1 EST1_HUMAN Serine hydrolase (CES1)
Type:
Protein
Mol. Mass.:
62520.83
Organism:
Homo sapiens (Human)
Description:
Residue:
567
  
Inhibitor
Name:
BDBM195577
Synonyms:
(2S,4S)-1-(3-(4-(2-morpholinopyrimidin-5-yl)phenyl)-1H-1,2,4-triazole-1-carbonyl)-2-phenylpiperidine-4-carboxylic acid (8)
Type:
Small organic molecule
Emp. Form.:
C29H29N7O4
Mol. Mass.:
539.5851
SMILES:
OC(=O)[C@H]1CCN([C@@H](C1)c1ccccc1)C(=O)n1cnc(n1)-c1ccc(cc1)-c1cnc(nc1)N1CCOCC1
: