Target
Amine oxidase [flavin-containing] B
Ligand
BDBM218829
Substrate
Meas. Tech.
In-vitro Monoamine Oxidase Inhibition Assay
pH
7.4±n/a
IC50
5.1e+2± 2e+1 nM
Comments
extracted
Citation
 Abbas, NZaib, SBakht, SMIbrar, AKhan, IBatool, SSaeed, AIqbal, J Symmetrical aryl linked bis-iminothiazolidinones as new chemical entities for the inhibition of monoamine oxidases: Synthesis, in vitro biological evaluation and molecular modelling analysis. Bioorg Chem 70:17-26 (2017)  
Target
Name:
Amine oxidase [flavin-containing] B
Synonyms:
AOFB_HUMAN MAOB Monoamine oxidase type B (MAO B) Monoamine oxidase type B (MAOB)
Type:
Protein
Mol. Mass.:
58768.76
Organism:
Homo sapiens (Human)
Description:
P27338
Residue:
520
  
Inhibitor
Name:
BDBM218829
Synonyms:
1,4-Bis(2-pentanoylimino-5-(2-methoxy-2-oxoethylidene)-4-oxo-thiazolidin-3-yl)benzene (5a)
Type:
Small organic molecule
Emp. Form.:
C28H30N4O8S2
Mol. Mass.:
614.69
SMILES:
CCCCC(=O)\N=C1/S\C(=C/C(=O)OC)C(=O)N1c1ccc(cc1)N1\C(S\C(=C/C(=O)OC)C1=O)=N\C(=O)CCCC
: