Target
Metabotropic glutamate receptor 3
Ligand
BDBM290558
Substrate
EC50
1098±330 nM
Citation
 Dhanya, RPSheffler, DJCosford, NDDahl, R Metabotropic glutamate receptor positive allosteric modulators (PAMS) and uses thereof US Patent  US10099993 Publication Date 10/16/2018 
Target
Name:
Metabotropic glutamate receptor 3
Synonyms:
GPRC1C GRM3_HUMAN metabotropic glutamate 3 metabotropic glutamate 3/1c
Type:
Enzyme Catalytic Domain
Mol. Mass.:
98889.09
Organism:
Homo sapiens (Human)
Description:
metabotropic glutamate 1c 0 HUMAN::Q14832
Residue:
879
  
Inhibitor
Name:
BDBM290558
Synonyms:
US10099993, Compound 139
Type:
Small organic molecule
Emp. Form.:
C27H27FO5
Mol. Mass.:
450.4987
SMILES:
Cc1c(O)c(ccc1OCc1cccc(c1)-c1cc(ccc1F)C(O)=O)C(=O)CC(C)(C)C
: