Target
Leucine-rich repeat serine/threonine-protein kinase 2 [970-2527,G2019S]
Ligand
BDBM223543
Substrate
Meas. Tech.
Kinase Activity Assay
pH
8.5±n/a
Temperature
303.15±n/a K
IC50
710±n/a nM
Comments
extracted
Citation
 Mikkelsen, GKDavid, LWatson, SSmith, GPWilliamson, DSChen, I Aminopyridine derived compounds as LRRK2 inhibitors US Patent  US9321748 Publication Date 4/26/2016 
Target
Name:
Leucine-rich repeat serine/threonine-protein kinase 2 [970-2527,G2019S]
Synonyms:
LRRK2 Leucine-rich repeat serine/threonine-protein kinase 2 (LRRK2) (G2019S) PARK8
Type:
Protein
Mol. Mass.:
177347.59
Organism:
Homo sapiens (Human)
Description:
Human LRRK2 variant (970-2527aa) with G2019S mutation
Residue:
1558
  
Inhibitor
Name:
BDBM223543
Synonyms:
US9321748, 3
Type:
Small organic molecule
Emp. Form.:
C19H19N5O
Mol. Mass.:
333.3871
SMILES:
CN1CCc2cc(ccc12)-c1cnc(N)c(c1)-c1nnc(o1)C1CC1
: