Target
Leucine-rich repeat serine/threonine-protein kinase 2 [970-2527,G2019S]
Ligand
BDBM223555
Substrate
Meas. Tech.
Kinase Activity Assay
pH
8.5±n/a
Temperature
303.15±n/a K
IC50
370±n/a nM
Comments
extracted
Citation
 Mikkelsen, GKDavid, LWatson, SSmith, GPWilliamson, DSChen, I Aminopyridine derived compounds as LRRK2 inhibitors US Patent  US9321748 Publication Date 4/26/2016 
Target
Name:
Leucine-rich repeat serine/threonine-protein kinase 2 [970-2527,G2019S]
Synonyms:
LRRK2 Leucine-rich repeat serine/threonine-protein kinase 2 (LRRK2) (G2019S) PARK8
Type:
Protein
Mol. Mass.:
177347.59
Organism:
Homo sapiens (Human)
Description:
Human LRRK2 variant (970-2527aa) with G2019S mutation
Residue:
1558
  
Inhibitor
Name:
BDBM223555
Synonyms:
US9321748, 15
Type:
Small organic molecule
Emp. Form.:
C21H25FN6O
Mol. Mass.:
396.4612
SMILES:
CC(C)n1cc(nn1)-c1cc(cnc1N)-c1ccc(CN2CCOCC2)c(F)c1
: