Target
Apoptosis regulator Bcl-2
Ligand
BDBM232451
Substrate
Meas. Tech.
Fluorescence Polarization Assay (FPA)
Temperature
298.15±n/a K
IC50
600±n/a nM
Comments
extracted
Citation
 Borzilleri, RMCai, ZTebben, AJPerez, HLZhang, LSchroeder, GMWei, DD Substituted sulfonamides useful as antiapoptotic Bcl inhibitors US Patent  US9346795 Publication Date 5/24/2016 
Target
Name:
Apoptosis regulator Bcl-2
Synonyms:
Apoptosis regulator Bcl-2 Protein BCL-2 BCL2_HUMAN | Bcl-2 Protein
Type:
Homodimer or heterodimer
Mol. Mass.:
26269.11
Organism:
Homo sapiens (Human)
Description:
P10415
Residue:
239
  
Inhibitor
Name:
BDBM232451
Synonyms:
US9346795, 286
Type:
Small organic molecule
Emp. Form.:
C41H42N4O5S
Mol. Mass.:
702.861
SMILES:
CCCCN(CCCC)C(=O)c1cccc(n1)-c1ccc(cc1C(=O)N1CCc2ccccc2C1)C(=O)NS(=O)(=O)c1ccc2ccccc2c1
: