Target
Isoform 1 of Metabotropic glutamate receptor 5 (5a)
Ligand
BDBM224623
Substrate
Meas. Tech.
Intracellular Ca2+ Mobilization Assay
Temperature
310.15±n/a K
EC50
16±n/a nM
Comments
extracted
Citation
 Jaeschke, GLindemann, LRicci, ARueher, DStadler, HVieira, E Ethynyl derivatives US Patent  US9359301 Publication Date 6/7/2016 
Target
Name:
Isoform 1 of Metabotropic glutamate receptor 5 (5a)
Synonyms:
GPRC1E GRM5_HUMAN Metabotropic glutamate receptor 5 Metabotropic glutamate receptor 5 (mGlu5a) Metabotropic glutamate receptor 5a (mGluR5) Metabotropic glutamate receptor subtype 5 (mGluR5)
Type:
Enzyme
Mol. Mass.:
128885.13
Organism:
Homo sapiens (Human)
Description:
P41594-2
Residue:
1180
  
Inhibitor
Name:
BDBM224623
Synonyms:
US9328070, Reference compound 1 | US9359301, Reference compound 1
Type:
Small organic molecule
Emp. Form.:
C19H19FN2O
Mol. Mass.:
310.3654
SMILES:
CN(C(=O)c1ccc(cn1)C#Cc1cccc(F)c1)C(C)(C)C
: