Target
Tyrosine-protein kinase JAK1
Ligand
BDBM236509
Substrate
Meas. Tech.
Kinase Assay
pH
7.5±n/a
Temperature
298.15±n/a K
IC50
31±n/a nM
Comments
extracted
Citation
 Xi, NLi, MLi, XDai, WWang, T Substituted heteroaryl compounds and methods of use US Patent  US9394281 Publication Date 7/19/2016 
Target
Name:
Tyrosine-protein kinase JAK1
Synonyms:
JAK-1 JAK1A JAK1_HUMAN Janus kinase 1 (JAK1) | Janus kinase 1 JAK1
Type:
Protein
Mol. Mass.:
133293.73
Organism:
Homo sapiens (Human)
Description:
P23458
Residue:
1154
  
Inhibitor
Name:
BDBM236509
Synonyms:
US9394281, 8
Type:
Small organic molecule
Emp. Form.:
C15H20ClN7O4S
Mol. Mass.:
429.882
SMILES:
Cn1cc(Nc2ncc(Cl)c(NC3COC4C(COC34)NS(C)(=O)=O)n2)cn1
: