Target
Genome polyprotein [2420-3010]
Ligand
BDBM64587
Substrate
Meas. Tech.
NS5B RNA Polymerase Assay
pH
7.5±n/a
IC50
2.1e+3± 3e+2 nM
Comments
extracted
Citation
 Deshpande, MWiles, JAHashimoto, APhadke, A Highly active nucleoside derivative for the treatment of HCV US Patent  US9447132 Publication Date 9/20/2016 
Target
Name:
Genome polyprotein [2420-3010]
Synonyms:
POLG_HCVCO RNA-directed RNA polymerase (NS5B)
Type:
Enzyme
Mol. Mass.:
65783.36
Organism:
Hepatitis C virus genotype 1b (isolate Con1) (HCV)
Description:
aa 2420-3010
Residue:
591
  
Inhibitor
Name:
BDBM64587
Synonyms:
US9447132, GS-7977 | sofosbuvir
Type:
Emp. Form.:
C22H29FN3O9P
Mol. Mass.:
529.4525
SMILES:
CC(C)OC(=O)C(C)NP(=O)(OCC1OC(n2ccc(=O)[nH]c2=O)C(C)(F)C1O)Oc1ccccc1
: