Target
Genome polyprotein [2420-3010]
Ligand
BDBM249180
Substrate
Meas. Tech.
Cell-Based HCV Replicon Assay
Temperature
321.15±n/a K
EC50
>100000±n/a nM
Comments
extracted
Citation
 Girijavallabhan, VBogen, SPan, WDang, QDavies, I 2′-disubstituted nucleoside derivatives and methods of use thereof for the treatment of viral diseases US Patent  US9457039 Publication Date 10/4/2016 
Target
Name:
Genome polyprotein [2420-3010]
Synonyms:
POLG_HCVBK | RNA-directed RNA polymerase (NS5B)
Type:
Enzyme
Mol. Mass.:
65648.71
Organism:
Hepatitis C virus genotype 1b (isolate BK) (HCV)
Description:
aa 2420-3010
Residue:
591
  
Inhibitor
Name:
BDBM249180
Synonyms:
US9457039, 3
Type:
Small organic molecule
Emp. Form.:
C11H14N8O3
Mol. Mass.:
306.2807
SMILES:
C[C@@]1(N=[N+]=[N-])[C@H](O)[C@@H](CO)O[C@H]1c1cnc2c(N)ncnn12
: