Target
Genome polyprotein [2420-3010]
Ligand
BDBM249190
Substrate
Meas. Tech.
Cell-Based HCV Replicon Assay
Temperature
321.15±n/a K
EC50
28000±n/a nM
Comments
extracted
Citation
 Girijavallabhan, VBogen, SPan, WDang, QDavies, I 2′-disubstituted nucleoside derivatives and methods of use thereof for the treatment of viral diseases US Patent  US9457039 Publication Date 10/4/2016 
Target
Name:
Genome polyprotein [2420-3010]
Synonyms:
POLG_HCVBK | RNA-directed RNA polymerase (NS5B)
Type:
Enzyme
Mol. Mass.:
65648.71
Organism:
Hepatitis C virus genotype 1b (isolate BK) (HCV)
Description:
aa 2420-3010
Residue:
591
  
Inhibitor
Name:
BDBM249190
Synonyms:
US9457039, 14 | US9457039, 15
Type:
Small organic molecule
Emp. Form.:
C23H32N7O7P
Mol. Mass.:
549.5166
SMILES:
CC(C)OC(=O)[C@H](C)NP(=O)(OC[C@H]1O[C@@H](c2cnn3c(N)ncnc23)[C@](C)(N)[C@@H]1O)Oc1ccccc1
: